{"text_format":"1","workbook":"xlsx","n_sheets":9,"sheets":["references","MMAT ref","Introduction","Guidelines","Profile and Scope","Configuration","Text clean","Assessment","Results"],"not_rendered":{"charts":1,"images":5,"macros":1,"external_links":0,"defined_names":50,"comments":0,"pivot_tables":0},"unopened":[],"bounds":{"document_bytes":16777216,"sheet_cells":100000,"rows_first":2000,"rows_last":500,"rows_between":2000,"halvings":0,"cell_chars":16384,"cell_head_chars":4096},"cells_cut":0,"cells_raw":0,"read":"whole","date_system":"1900"}

{"sheet":"references","index":0,"n_rows":49,"n_cols":21,"rows_kept":49,"cut":false,"hidden":true,"merged":[]}
["Not yet answered",null,1,2,3,4,5,6,7,8,9,null,"Not yet answered",null,null,22,null,null,"x 1",1,{"$f":"S1","v":"x 1"}]
["Level 1 - Initial",null,"Not Yet answered","Level 1 - Initial","Level 2 - Established","Level 3 - Business Enabling","Level 4 - Quantitatively Managed","Level 5 - Optimised","Don't know","Not applicable","Question not selected",null,"Level 1 - Initial",null,null,null,null,null,"x 2",2,{"$f":"S2","v":"x 2"}]
["Level 2 - Established",null,{"$f":"\"\"","v":""},1,2,3,4,5,1,{"$f":"\"\"","v":""},{"$f":"\"\"","v":""},null,"Level 2 - Established",null,null,null,null,null,"x 3",3,{"$f":"S3","v":"x 3"}]
["Level 3 - Business Enabling",null,null,null,null,null,null,null,null,null,null,null,"Level 3 - Business Enabling"]
["Level 4 - Quantitatively Managed",null,null,null,null,null,null,null,null,null,null,null,"Level 4 - Quantitatively Managed",null,null,null,null,"Level 1",1]
["Level 5 - Optimised",null,null,null,null,null,null,null,null,null,null,null,"Level 5 - Optimised",null,null,null,null,"Level 2",1]
["Don't know",null,null,null,null,null,null,null,null,null,null,null,null,null,null,null,null,"Level 3",2]
["Not applicable",null,null,null,null,null,null,null,null,null,null,null,null,null,null,null,null,"Level 4",3]
{"$rows_left_out":42}
{"sheet":"MMAT ref","index":1,"n_rows":18,"n_cols":36,"rows_kept":18,"cut":false,"hidden":true,"merged":[]}
["CSIR","Overall",{"$f":"AVERAGE(K:K)","v":{"$error":"#DIV/0!"}},{"$f":"IF(ISERROR(C1),\"\",C1)","v":""},{"$f":"AVERAGE(M:M)","v":{"$error":"#DIV/0!"}},{"$f":"IF(ISERROR(E1),\"\",E1)","v":""},null,1,"MMAT1",{"$f":"IF(SUMIF(N:N,H1,U:U)=0,\"\",SUMIF(N:N,H1,U:U)/(MAX(T:T)*COUNTIF(V:V,H1)))","v":""},{"$f":"IF(ISERROR(J1),\"\",J1)","v":""},{"$f":"IF(SUMIF(N:N,H1,Y:Y)=0,\"\",SUMIF(N:N,H1,Y:Y)/(MAX(T:T)*COUNTIF(Z:Z,H1)))","v":""},{"$f":"IF(ISERROR(L1),\"\",L1)","v":""},1,1,1,{"$f":"N1&\".\"&O1","v":"1.1"},{"$f":"VLOOKUP(Q1,Assessment!N:Q,4,FALSE)","v":""},{"$f":"VLOOKUP(Q1,Assessment!N:T,7,FALSE)","v":1},{"$f":"IF(LEN(R1)>0,S1,\"\")","v":""},{"$f":"IF(ISERROR(T1*R1),\"\",T1*R1)","v":""},{"$f":"IF(LEN(U1)>0,N1,\"\")","v":""},{"$f":"VLOOKUP(Q1,Configuration!M:S,7,FALSE)","v":""},{"$f":"IF(LEN(W1)>0,S1,\"\")","v":""},{"$f":"IF(ISERROR(X1*W1),\"\",X1*W1)","v":""},{"$f":"IF(LEN(Y1)>0,N1,\"\")","v":""},null,1,1,1,null,null,{"$f":"IF(AC1=1,AD1,AD1&\".\"&AE1)","v":1},{"$f":"IF(AC1=1,\"Phase \"&AD1,\"Step \"&AE1)","v":"Phase 1"},"Prepare","Prepare"]
[null,null,null,null,null,null,null,2,"MMAT2",{"$f":"IF(SUMIF(N:N,H2,U:U)=0,\"\",SUMIF(N:N,H2,U:U)/(MAX(T:T)*COUNTIF(V:V,H2)))","v":""},{"$f":"IF(ISERROR(J2),\"\",J2)","v":""},{"$f":"IF(SUMIF(N:N,H2,Y:Y)=0,\"\",SUMIF(N:N,H2,Y:Y)/(MAX(T:T)*COUNTIF(Z:Z,H2)))","v":""},{"$f":"IF(ISERROR(L2),\"\",L2)","v":""},1,2,2,{"$f":"N2&\".\"&O2","v":"1.2"},{"$f":"VLOOKUP(Q2,Assessment!N:Q,4,FALSE)","v":""},{"$f":"VLOOKUP(Q2,Assessment!N:T,7,FALSE)","v":1},{"$f":"IF(LEN(R2)>0,S2,\"\")","v":""},{"$f":"IF(ISERROR(T2*R2),\"\",T2*R2)","v":""},{"$f":"IF(LEN(U2)>0,N2,\"\")","v":""},{"$f":"VLOOKUP(Q2,Configuration!M:S,7,FALSE)","v":""},{"$f":"IF(LEN(W2)>0,S2,\"\")","v":""},{"$f":"IF(ISERROR(X2*W2),\"\",X2*W2)","v":""},{"$f":"IF(LEN(Y2)>0,N2,\"\")","v":""},null,2,2,1,1,1,{"$f":"IF(AC2=1,AD2,AD2&\".\"&AE2)","v":"1.1"},{"$f":"IF(AC2=1,\"Phase \"&AD2,\"Step \"&AE2)","v":"Step 1"},"Conduct a criticality assessment for your organisation","Criticality assessment"]
[null,null,null,null,null,null,null,3,"MMAT3",{"$f":"IF(SUMIF(N:N,H3,U:U)=0,\"\",SUMIF(N:N,H3,U:U)/(MAX(T:T)*COUNTIF(V:V,H3)))","v":""},{"$f":"IF(ISERROR(J3),\"\",J3)","v":""},{"$f":"IF(SUMIF(N:N,H3,Y:Y)=0,\"\",SUMIF(N:N,H3,Y:Y)/(MAX(T:T)*COUNTIF(Z:Z,H3)))","v":""},{"$f":"IF(ISERROR(L3),\"\",L3)","v":""},1,3,3,"1.3",{"$f":"VLOOKUP(Q3,Assessment!N:Q,4,FALSE)","v":""},{"$f":"VLOOKUP(Q3,Assessment!N:T,7,FALSE)","v":1},"","","",{"$f":"VLOOKUP(Q3,Configuration!M:S,7,FALSE)","v":""},"","","",null,3,2,1,2,2,"1.2","Step 2","Carry out a cyber security threat analysis, supported by realistic scenarios and rehearsals","Threat analysis"]
[null,null,null,null,null,null,null,null,null,null,null,null,null,1,4,4,"1.4",{"$f":"VLOOKUP(Q4,Assessment!N:Q,4,FALSE)","v":""},{"$f":"VLOOKUP(Q4,Assessment!N:T,7,FALSE)","v":1},"","","",{"$f":"VLOOKUP(Q4,Configuration!M:S,7,FALSE)","v":""},"","","",null,4,2,1,3,3,"1.3","Step 3","Consider the implications of people, process and technology","People, Process, Technology and Information"]
[null,null,null,null,null,null,null,null,null,null,null,null,null,1,5,5,"1.5",{"$f":"VLOOKUP(Q5,Assessment!N:Q,4,FALSE)","v":""},{"$f":"VLOOKUP(Q5,Assessment!N:T,7,FALSE)","v":1},"","","",{"$f":"VLOOKUP(Q5,Configuration!M:S,7,FALSE)","v":""},"","","",null,5,2,1,4,4,"1.4","Step 4","Create an appropriate control environment","Control environment"]
[null,null,null,null,null,null,null,null,null,null,null,null,null,2,1,6,"2.1",{"$f":"VLOOKUP(Q6,Assessment!N:Q,4,FALSE)","v":""},{"$f":"VLOOKUP(Q6,Assessment!N:T,7,FALSE)","v":1},"","","",{"$f":"VLOOKUP(Q6,Configuration!M:S,7,FALSE)","v":""},"","","",null,6,2,1,5,5,"1.5","Step 5","Review your state of readiness in cyber security response","Maturity assessment"]
[null,null,null,null,null,null,null,null,null,null,null,null,null,2,2,7,"2.2",{"$f":"VLOOKUP(Q7,Assessment!N:Q,4,FALSE)","v":""},{"$f":"VLOOKUP(Q7,Assessment!N:T,7,FALSE)","v":1},"","","",{"$f":"VLOOKUP(Q7,Configuration!M:S,7,FALSE)","v":""},"","","",null,7,1,2,null,null,2,"Phase 2","Respond","Respond"]
[null,null,null,null,null,null,null,null,null,null,null,null,null,2,3,8,"2.3",{"$f":"VLOOKUP(Q8,Assessment!N:Q,4,FALSE)","v":""},{"$f":"VLOOKUP(Q8,Assessment!N:T,7,FALSE)","v":1},"","","",{"$f":"VLOOKUP(Q8,Configuration!M:S,7,FALSE)","v":""},"","","",null,8,2,2,1,6,"2.1","Step 1","Identify cyber security incident","Identification"]
{"$rows_left_out":11}
{"sheet":"Introduction","index":2,"n_rows":85,"n_cols":4,"rows_kept":85,"cut":false,"hidden":false,"merged":[[71,1,72,11],[76,1,77,11],[86,1,86,11],[1,3,4,15],[11,1,15,11],[17,1,20,11],[21,1,23,11],[28,1,31,11],[37,1,39,11],[32,1,34,11],[80,1,80,11]]}
[]
[null,null,null,"Cyber Security Incident Response \nHigh-level Maturity Assessment Tool"]
[]
[]
[]
[]
[]
[null,"Introduction"]
{"$rows_left_out":78}
{"sheet":"Guidelines","index":3,"n_rows":82,"n_cols":4,"rows_kept":82,"cut":false,"hidden":false,"merged":[[81,1,85,11],[43,1,46,11],[1,3,4,15],[11,1,13,11],[15,1,17,11],[34,1,37,11],[39,1,42,11],[74,1,76,11],[78,1,79,11],[69,1,72,11],[50,1,52,11],[54,1,57,11],[59,1,61,11],[63,1,67,11]]}
[]
[null,null,null,"Cyber Security Incident Response \nHigh-level Maturity Assessment Tool"]
[]
[]
[]
[]
[]
[null,"Guidelines"]
{"$rows_left_out":75}
{"sheet":"Profile and Scope","index":4,"n_rows":45,"n_cols":5,"rows_kept":45,"cut":false,"hidden":false,"merged":[[0,4,0,6],[41,5,41,6],[44,5,44,6],[35,5,35,6],[4,5,4,6],[7,5,7,6],[10,5,10,6],[26,5,26,6],[29,5,29,6],[32,5,32,6],[19,5,19,6]]}
[null,null,null,null,"Cyber Security Incident Response \nHigh-level Maturity Assessment Tool"]
[]
[null,null,null,null,"Scope of assessment     All fields marked * MUST be completed"]
[]
[null,null,null,null,"Name of area of assessment *"]
[]
[]
[null,null,null,null,"Business unit (or equivalent) *"]
{"$rows_left_out":38}
{"sheet":"Configuration","index":5,"n_rows":21,"n_cols":33,"rows_kept":21,"cut":false,"hidden":false,"merged":[]}
[null,null,null,null,"Configuration"]
[null,null,null,"Cyber Security Incident Response Maturity Model Assessment Tool"]
[null,null,null,null,null,"Not selected","Target maturity level","Weighting","Evidence required"]
[1,{"$f":"IF(ISBLANK(C4),\"\",A4)","v":""},null,null,{"$f":"AF4&\" - \"&AG4","v":"Phase 1 - Prepare"},null,null,null,null,null,null,null,null,1,null,null,null,null,null,null,null,null,null,null,null,null,null,null,null,null,null,{"$f":"VLOOKUP($N4,MMATref,7,FALSE)","v":"Phase 1"},{"$f":"VLOOKUP($N4,MMATref,8,FALSE)","v":"Prepare"}]
[{"$f":"IF(ISBLANK(C5),A4+1,A4)","v":1},1,{"$f":"VLOOKUP(N5,MMATref,5,FALSE)","v":1},null,"Step 1 - Conduct a criticality assessment for your organisation",null,null,null,null,null,null,null,{"$f":"B5&\".\"&VLOOKUP(N5,MMATref,4,FALSE)","v":"1.1"},2,null,1,false,{"$f":"HLOOKUP(P5,target_scores,3,FALSE)","v":""},{"$f":"IF(R5=\"Null\",\"\",R5)","v":""},null,null,null,null,null,null,null,{"$f":"IF(LEN(I5)=0,\"\",I5)","v":""},null,null,null,null,"Step 1","Conduct a criticality assessment for your organisation"]
[1,1,{"$f":"VLOOKUP(N6,MMATref,5,FALSE)","v":2},null,"Step 2 - Carry out a cyber security threat analysis, supported by realistic scenarios and rehearsals",null,null,null,null,null,null,null,{"$f":"B6&\".\"&VLOOKUP(N6,MMATref,4,FALSE)","v":"1.2"},3,null,1,false,{"$f":"HLOOKUP(P6,target_scores,3,FALSE)","v":""},{"$f":"IF(R6=\"Null\",\"\",R6)","v":""},null,null,null,null,null,null,null,{"$f":"IF(LEN(I6)=0,\"\",I6)","v":""},null,null,null,null,"Step 2","Carry out a cyber security threat analysis, supported by realistic scenarios and rehearsals"]
[1,1,{"$f":"VLOOKUP(N7,MMATref,5,FALSE)","v":3},null,"Step 3 - Consider the implications of people, process and technology",null,null,null,null,null,null,null,{"$f":"B7&\".\"&VLOOKUP(N7,MMATref,4,FALSE)","v":"1.3"},4,null,1,false,{"$f":"HLOOKUP(P7,target_scores,3,FALSE)","v":""},"",null,null,null,null,null,null,null,"",null,null,null,null,"Step 3","Consider the implications of people, process and technology"]
[1,1,{"$f":"VLOOKUP(N8,MMATref,5,FALSE)","v":4},null,"Step 4 - Create an appropriate control environment",null,null,null,null,null,null,null,{"$f":"B8&\".\"&VLOOKUP(N8,MMATref,4,FALSE)","v":"1.4"},5,null,1,false,{"$f":"HLOOKUP(P8,target_scores,3,FALSE)","v":""},"",null,null,null,null,null,null,null,"",null,null,null,null,"Step 4","Create an appropriate control environment"]
{"$rows_left_out":14}
{"sheet":"Text clean","index":6,"n_rows":61,"n_cols":30,"rows_kept":61,"cut":false,"hidden":true,"merged":[]}
[null,null,null,null,null,null,null,null,null,null,null,null,"1.1.1","Level 1","Have you defined your critical information assets (eg important business applications, key systems and confidential data)?",null,null,null,{"$f":"FIND(\".\",M1)","v":2},{"$f":"FIND(\".\",M1,S1+1)","v":4},{"$f":"LEFT(M1,S1-1)","v":"1"},{"$f":"MID(M1,S1+1,T1-S1-1)","v":"1"},{"$f":"RIGHT(M1,LEN(M1)-T1)","v":"1"},{"$f":"VALUE(W1)","v":1},{"$f":"IF(ISERROR(X1),LEFT(W1,LEN(W1)-1),W1)","v":"1"},{"$f":"IF(ISERROR(X1),RIGHT(W1,1),\"\")","v":""},{"$f":"TEXT(Y1,\"00\")","v":"01"},{"$f":"U1&\".\"&V1&\".\"&AA1&IF(LEN(Z1)=0,\"\",\".\"&Z1)","v":"1.1.01"},{"$f":"N1","v":"Level 1"},{"$f":"O1","v":"Have you defined your critical information assets (eg important business applications, key systems and confidential data)?"}]
[null,null,null,null,null,null,null,null,null,null,null,null,"1.1.2","Level 2","Do you carry out criticality assessments?",null,null,null,{"$f":"FIND(\".\",M2)","v":2},{"$f":"FIND(\".\",M2,S2+1)","v":4},{"$f":"LEFT(M2,S2-1)","v":"1"},{"$f":"MID(M2,S2+1,T2-S2-1)","v":"1"},{"$f":"RIGHT(M2,LEN(M2)-T2)","v":"2"},{"$f":"VALUE(W2)","v":2},{"$f":"IF(ISERROR(X2),LEFT(W2,LEN(W2)-1),W2)","v":"2"},{"$f":"IF(ISERROR(X2),RIGHT(W2,1),\"\")","v":""},{"$f":"TEXT(Y2,\"00\")","v":"02"},{"$f":"U2&\".\"&V2&\".\"&AA2&IF(LEN(Z2)=0,\"\",\".\"&Z2)","v":"1.1.02"},{"$f":"N2","v":"Level 2"},{"$f":"O2","v":"Do you carry out criticality assessments?"}]
[null,null,null,null,null,null,null,null,null,null,null,null,"1.1.3","","Are critical information assets defined in a:",null,null,null,2,4,"1","1","3",3,"3","","03","1.1.03","","Are critical information assets defined in a:"]
[null,null,null,null,null,null,null,null,null,null,null,null,"1.1.3a","Level 2","Structured, systematic manner?",null,null,null,2,4,"1","1","3a",{"$error":"#VALUE!"},"3","a","03","1.1.03.a","Level 2","Structured, systematic manner?"]
[null,null,null,null,null,null,null,null,null,null,null,null,"1.1.3b","Level 3","Quantitative manner, (eg in terms of their strategic or monetary value)?",null,null,null,2,4,"1","1","3b",{"$error":"#VALUE!"},"3","b","03","1.1.03.b","Level 3","Quantitative manner, (eg in terms of their strategic or monetary value)?"]
[null,null,null,null,null,null,null,null,null,null,null,null,"1.1.4","","Do your criticality assessments include:",null,null,null,2,4,"1","1","4",4,"4","","04","1.1.04","","Do your criticality assessments include:"]
[null,null,null,null,null,null,null,null,null,null,null,null,"1.1.4a","Level 3","Determining which cyber security threats are most likely to affect these critical information assets?",null,null,null,2,4,"1","1","4a",{"$error":"#VALUE!"},"4","a","04","1.1.04.a","Level 3","Determining which cyber security threats are most likely to affect these critical information assets?"]
[null,null,null,null,null,null,null,null,null,null,null,null,"1.1.4b","Level 3","Applying the relevant management or technical controls to reduce the likelihood and impact of cyber security incidents affecting their critical information assets?",null,null,null,2,4,"1","1","4b",{"$error":"#VALUE!"},"4","b","04","1.1.04.b","Level 3","Applying the relevant management or technical controls to reduce the likelihood and impact of cyber security incidents affecting their critical information assets?"]
{"$rows_left_out":54}
{"sheet":"Assessment","index":7,"n_rows":21,"n_cols":33,"rows_kept":21,"cut":false,"hidden":false,"merged":[]}
[null,null,null,null,"High-level assessment",null,null,null,null,null,null,null,null,null,null,null,{"$f":"AVERAGE(Q4:Q21)","v":{"$error":"#DIV/0!"}}]
[null,null,null,null,{"$f":"$B3&\" questions answered out of \"&qcountselected","v":{"$error":"#NAME?"}},{"$f":"\"(\"&qcountselected&\" questions selected out of a possible \"&qcount&\")\"","v":{"$error":"#NAME?"}},null,null,null,"Sum of scores","No. of questions","No. of selected questions"]
[null,{"$f":"COUNTIF(P:P,\">1\")-COUNTIF(P:P,\">8\")","v":0},null,null,"Statement","Level of maturity","Weighting","Evidence","Comments",{"$f":"SUM($Q4:$Q1048576)","v":0},{"$f":"MAX($C4:$C199)","v":15},{"$f":"qcount-COUNTIF($P:$P,9)","v":{"$error":"#NAME?"}}]
[1,{"$f":"IF(ISBLANK(C4),\"\",A4)","v":""},null,null,{"$f":"AE4&\" - \"&AF4","v":"Phase 1 - Prepare"},null,null,null,null,null,"No. of selected questions answered",{"$f":"IF(C4=\"\",\"\",MOD(C4,2))","v":""},1,null,null,null,{"$f":"IF(P4=\"\",\"\",HLOOKUP(P4,stuff,3))","v":""},null,null,{"$f":"IF(S4=\"\",\"\",HLOOKUP(S4,weighting_stuff,3))","v":""},null,null,null,null,null,null,null,null,null,null,{"$f":"VLOOKUP($M4,MMATref,7,FALSE)","v":"Phase 1"},{"$f":"VLOOKUP($M4,MMATref,8,FALSE)","v":"Prepare"},{"$f":"IF(OR(ISBLANK(Q4),Q4=\"Null\"),\"\",Q4)","v":""}]
[{"$f":"IF(ISBLANK(C5),A4+1,A4)","v":1},1,{"$f":"VLOOKUP(M5,MMATref,5,FALSE)","v":1},null,{"$f":"AE5&\" - \"&AF5","v":"Step 1 - Conduct a criticality assessment for your organisation"},null,null,{"$f":"VLOOKUP(M5,Configuration!N:AA,14,FALSE)","v":""},null,null,{"$f":"B3","v":0},1,2,{"$f":"B5&\".\"&VLOOKUP(M5,MMATref,4,FALSE)","v":"1.1"},null,1,"",1,{"$f":"R5","v":1},1,null,null,null,null,null,null,null,null,null,null,"Step 1","Conduct a criticality assessment for your organisation",""]
[1,1,{"$f":"VLOOKUP(M6,MMATref,5,FALSE)","v":2},null,"Step 2 - Carry out a cyber security threat analysis, supported by realistic scenarios and rehearsals",null,null,{"$f":"VLOOKUP(M6,Configuration!N:AA,14,FALSE)","v":""},null,null,null,0,3,{"$f":"B6&\".\"&VLOOKUP(M6,MMATref,4,FALSE)","v":"1.2"},null,1,"",1,{"$f":"R6","v":1},1,null,null,null,null,null,null,null,null,null,null,"Step 2","Carry out a cyber security threat analysis, supported by realistic scenarios and rehearsals",""]
[1,1,{"$f":"VLOOKUP(M7,MMATref,5,FALSE)","v":3},null,"Step 3 - Consider the implications of people, process and technology",null,null,{"$f":"VLOOKUP(M7,Configuration!N:AA,14,FALSE)","v":""},null,null,null,1,4,{"$f":"B7&\".\"&VLOOKUP(M7,MMATref,4,FALSE)","v":"1.3"},null,1,"",1,{"$f":"R7","v":1},1,null,null,null,null,null,null,null,null,null,null,"Step 3","Consider the implications of people, process and technology",""]
[1,1,{"$f":"VLOOKUP(M8,MMATref,5,FALSE)","v":4},null,"Step 4 - Create an appropriate control environment",null,null,{"$f":"VLOOKUP(M8,Configuration!N:AA,14,FALSE)","v":""},null,null,null,0,5,{"$f":"B8&\".\"&VLOOKUP(M8,MMATref,4,FALSE)","v":"1.4"},null,1,"",1,{"$f":"R8","v":1},1,null,null,null,null,null,null,null,null,null,null,"Step 4","Create an appropriate control environment",""]
{"$rows_left_out":14}
{"sheet":"Results","index":8,"n_rows":21,"n_cols":35,"rows_kept":21,"cut":false,"hidden":false,"merged":[[1,4,1,5],[1,6,1,7],[0,3,0,17]]}
[null,null,null,{"$f":"\"Aggregated maturity level results\"&IF(LEN(scope_area_of_assessment)=0,\"\",\" for \"&scope_area_of_assessment)","v":"Aggregated maturity level results"}]
[null,null,"Cyber Security Incident Response","Cyber Security Incident Response","Maturity level (1 to 5)",null,"Target maturity (1 to 5)",null,null,null,null,null,null,null,null,null,null,null,null,null,null,null,null,null,null,null,null,"rating","target",1,2,3,1,2,3]
[null,"CSIR",{"$f":"VLOOKUP(B3,'MMAT ref'!A:E,2,FALSE)","v":"Overall"},{"$f":"B3&\" - \"&C3","v":"CSIR - Overall"},{"$f":"VLOOKUP(B3,'MMAT ref'!A:E,4,FALSE)","v":""},{"$f":"IF(ISERROR(E3),\"\",E3)","v":""},{"$f":"H3","v":""},{"$f":"VLOOKUP(B3,'MMAT ref'!A:F,6,FALSE)","v":""}]
[null,{"$f":"'MMAT ref'!AG1","v":1},{"$f":"VLOOKUP(B4,'MMAT ref'!AG:AJ,4,FALSE)","v":"Prepare"},{"$f":"VLOOKUP(B4,'MMAT ref'!AG:AI,2,FALSE)& \" - \"&C4","v":"Phase 1 - Prepare"},{"$f":"VLOOKUP(B4,'MMAT ref'!H:K,4,FALSE)","v":""},{"$f":"IF(ISERROR(E4),\"\",E4)","v":""},{"$f":"H4","v":""},{"$f":"VLOOKUP(B4,'MMAT ref'!H:M,6,FALSE)","v":""},null,null,null,null,null,null,null,null,null,null,null,null,null,null,null,null,null,{"$f":"'MMAT ref'!Q1","v":"1.1"},{"$f":"Z4&\" - \"&VLOOKUP(Z4,textref,4,FALSE)","v":"1.1 - Criticality assessment"},{"$f":"VLOOKUP(Z4,'MMAT ref'!Q:R,2,FALSE)","v":""},{"$f":"VLOOKUP(Z4,'MMAT ref'!Q:W,7,FALSE)","v":""},{"$f":"IF(IF(VALUE(LEFT($AA4,1))=AD$2,$AB4,\"\")=\"\",#N/A,IF(VALUE(LEFT($AA4,1))=AD$2,$AB4,\"\"))","v":{"$error":"#N/A"}},null,null,{"$f":"IF(LEN(IF(VALUE(LEFT($AA4,1))=AG$2,$AC4,\"\"))=0,#N/A,IF(VALUE(LEFT($AA4,1))=AG$2,$AC4,\"\"))","v":{"$error":"#N/A"}}]
[null,{"$f":"'MMAT ref'!AG2","v":"1.1"},{"$f":"VLOOKUP(B5,'MMAT ref'!AG:AJ,4,FALSE)","v":"Criticality assessment"},{"$f":"VLOOKUP(B5,'MMAT ref'!AG:AI,2,FALSE)& \" - \"&C5","v":"Step 1 - Criticality assessment"},{"$f":"VLOOKUP(B5,'MMAT ref'!Q:R,2,FALSE)","v":""},{"$f":"IF(ISERROR(E5),\"\",E5)","v":""},{"$f":"H5","v":""},{"$f":"VLOOKUP(B5,'MMAT ref'!Q:W,7,FALSE)","v":""},null,null,null,null,null,null,null,null,null,null,null,null,null,null,null,null,null,{"$f":"'MMAT ref'!Q2","v":"1.2"},"1.2 - Threat analysis",{"$f":"VLOOKUP(Z5,'MMAT ref'!Q:R,2,FALSE)","v":""},{"$f":"VLOOKUP(Z5,'MMAT ref'!Q:W,7,FALSE)","v":""},{"$f":"IF(IF(VALUE(LEFT($AA5,1))=AD$2,$AB5,\"\")=\"\",#N/A,IF(VALUE(LEFT($AA5,1))=AD$2,$AB5,\"\"))","v":{"$error":"#N/A"}},null,null,{"$f":"IF(LEN(IF(VALUE(LEFT($AA5,1))=AG$2,$AC5,\"\"))=0,#N/A,IF(VALUE(LEFT($AA5,1))=AG$2,$AC5,\"\"))","v":{"$error":"#N/A"}}]
[null,{"$f":"'MMAT ref'!AG3","v":"1.2"},{"$f":"VLOOKUP(B6,'MMAT ref'!AG:AJ,4,FALSE)","v":"Threat analysis"},{"$f":"VLOOKUP(B6,'MMAT ref'!AG:AI,2,FALSE)& \" - \"&C6","v":"Step 2 - Threat analysis"},{"$f":"VLOOKUP(B6,'MMAT ref'!Q:R,2,FALSE)","v":""},{"$f":"IF(ISERROR(E6),\"\",E6)","v":""},{"$f":"H6","v":""},{"$f":"VLOOKUP(B6,'MMAT ref'!Q:W,7,FALSE)","v":""},null,null,null,null,null,null,null,null,null,null,null,null,null,null,null,null,null,{"$f":"'MMAT ref'!Q3","v":"1.3"},"1.3 - People, Process, Technology and Information",{"$f":"VLOOKUP(Z6,'MMAT ref'!Q:R,2,FALSE)","v":""},{"$f":"VLOOKUP(Z6,'MMAT ref'!Q:W,7,FALSE)","v":""},{"$f":"IF(IF(VALUE(LEFT($AA6,1))=AD$2,$AB6,\"\")=\"\",#N/A,IF(VALUE(LEFT($AA6,1))=AD$2,$AB6,\"\"))","v":{"$error":"#N/A"}},null,null,{"$f":"IF(LEN(IF(VALUE(LEFT($AA6,1))=AG$2,$AC6,\"\"))=0,#N/A,IF(VALUE(LEFT($AA6,1))=AG$2,$AC6,\"\"))","v":{"$error":"#N/A"}}]
[null,{"$f":"'MMAT ref'!AG4","v":"1.3"},{"$f":"VLOOKUP(B7,'MMAT ref'!AG:AJ,4,FALSE)","v":"People, Process, Technology and Information"},{"$f":"VLOOKUP(B7,'MMAT ref'!AG:AI,2,FALSE)& \" - \"&C7","v":"Step 3 - People, Process, Technology and Information"},{"$f":"VLOOKUP(B7,'MMAT ref'!Q:R,2,FALSE)","v":""},{"$f":"IF(ISERROR(E7),\"\",E7)","v":""},{"$f":"H7","v":""},{"$f":"VLOOKUP(B7,'MMAT ref'!Q:W,7,FALSE)","v":""},null,null,null,null,null,null,null,null,null,null,null,null,null,null,null,null,null,{"$f":"'MMAT ref'!Q4","v":"1.4"},"1.4 - Control environment",{"$f":"VLOOKUP(Z7,'MMAT ref'!Q:R,2,FALSE)","v":""},{"$f":"VLOOKUP(Z7,'MMAT ref'!Q:W,7,FALSE)","v":""},{"$f":"IF(IF(VALUE(LEFT($AA7,1))=AD$2,$AB7,\"\")=\"\",#N/A,IF(VALUE(LEFT($AA7,1))=AD$2,$AB7,\"\"))","v":{"$error":"#N/A"}},null,null,{"$f":"IF(LEN(IF(VALUE(LEFT($AA7,1))=AG$2,$AC7,\"\"))=0,#N/A,IF(VALUE(LEFT($AA7,1))=AG$2,$AC7,\"\"))","v":{"$error":"#N/A"}}]
[null,{"$f":"'MMAT ref'!AG5","v":"1.4"},{"$f":"VLOOKUP(B8,'MMAT ref'!AG:AJ,4,FALSE)","v":"Control environment"},{"$f":"VLOOKUP(B8,'MMAT ref'!AG:AI,2,FALSE)& \" - \"&C8","v":"Step 4 - Control environment"},{"$f":"VLOOKUP(B8,'MMAT ref'!Q:R,2,FALSE)","v":""},"","",{"$f":"VLOOKUP(B8,'MMAT ref'!Q:W,7,FALSE)","v":""},null,null,null,null,null,null,null,null,null,null,null,null,null,null,null,null,null,{"$f":"'MMAT ref'!Q5","v":"1.5"},"1.5 - Maturity assessment",{"$f":"VLOOKUP(Z8,'MMAT ref'!Q:R,2,FALSE)","v":""},{"$f":"VLOOKUP(Z8,'MMAT ref'!Q:W,7,FALSE)","v":""},{"$f":"IF(IF(VALUE(LEFT($AA8,1))=AD$2,$AB8,\"\")=\"\",#N/A,IF(VALUE(LEFT($AA8,1))=AD$2,$AB8,\"\"))","v":{"$error":"#N/A"}},null,null,{"$f":"IF(LEN(IF(VALUE(LEFT($AA8,1))=AG$2,$AC8,\"\"))=0,#N/A,IF(VALUE(LEFT($AA8,1))=AG$2,$AC8,\"\"))","v":{"$error":"#N/A"}}]
{"$rows_left_out":13}